{"text_format":"1","workbook":"xlsx","n_sheets":8,"sheets":["Einleitung","Start","Chefinfo","Angebote","Aufträge","Einrichtung","Anleitung","Intern"],"not_rendered":{"charts":0,"images":12,"macros":1,"external_links":0,"defined_names":16,"comments":0,"pivot_tables":0},"unopened":[],"bounds":{"document_bytes":16777216,"sheet_cells":100000,"rows_first":2000,"rows_last":500,"rows_between":2000,"halvings":0,"cell_chars":16384,"cell_head_chars":4096},"cells_cut":0,"cells_raw":0,"read":"whole","date_system":"1900"}

{"sheet":"Einleitung","index":0,"n_rows":0,"n_cols":0,"rows_kept":0,"cut":false,"hidden":false,"merged":[]}

{"sheet":"Start","index":1,"n_rows":65,"n_cols":27,"rows_kept":65,"cut":false,"hidden":false,"merged":[[26,11,27,12],[23,15,24,15],[15,4,15,5],[21,4,23,6],[21,11,24,12],[23,16,24,17],[19,15,21,15],[19,16,21,17],[13,7,13,14],[12,7,12,14],[14,6,14,15],[16,4,16,6]]}
[]
[null,null,"Auftragsplanung | Software"]
[]
[null,null,null,null,null,null,null,null,null,null,null,null,null,null,null,null,null,{"$f":"Intern!A4","v":"Version 1.20"},null,null,null,null,null,null,null,null,{"$f":" \"Firma:  \" &Start!Q20","v":"Firma:  Mustermann GmbH"}]
[]
[null,null,null,null,null,null,null,null,null,null,null,null,null,null,null," Auftragsplanung - Hauptmenü"]
[]
[]
[]
[]
[null,null,null,null,null,null,null,null,null,null,null,null,null,null,null,null,null,null,null,null,null,null,{"$f":"EDATE($W$17,-6)","v":"2016-02-01"}]
[null,null,null,null,null,null,null,null,null,null,null,null,null,null,null,null,null,null,null,null,null,null,{"$f":"EDATE($W$17,-5)","v":"2016-03-01"}]
[null,null,null,null,null,null,null,"Diese Software ist personalisiert für ",null,null,null,null,null,null,null,null,null,null,null,null,null,null,{"$f":"EDATE($W$17,-4)","v":"2016-04-01"}]
[null,null,null,null,null,null,null,"Max Muster",null,null,null,null,null,null,null,null,null,null,null,null,null,null,{"$f":"EDATE($W$17,-3)","v":"2016-05-01"}]
[null,null,null,null,null,null,"Mustermann GmbH | An der Burgermühle 10 | 83022 Rosenheim",null,null,null,null,null,null,null,null,null,null,null,null,null,null,null,{"$f":"EDATE($W$17,-2)","v":"2016-06-01"}]
{"$rows_left_out":51}
{"sheet":"Chefinfo","index":2,"n_rows":37,"n_cols":61,"rows_kept":37,"cut":false,"hidden":true,"merged":[[9,2,9,9],[25,2,25,9]]}
[]
[null,null,"Auftragsplanung | Chefinfo",null,null,null,null,"2016-02-04",null,null,null,null,null,null,null,null,null,null,null,null,null,null,null,null,null,null,null,null,null,null,null,null,null,null,null,null,null,null,null,null,null,null,null,null,null,null,null,null,null,null,null,null,null,null,null,null,null,null,{"$f":"TODAY()","v":"2016-08-09"}]
[null,null,null,null,null,null,null,null,null,null,null,null,null,null,null,null,null,null,null,null,null,null,null,null,null,null,null,null,null,null,null,null,null,null,null,null,null,null,null,null,null,null,null,null,null,null,null,null,null,null,null,null,null,null,null,null,null,1,{"$f":"YEAR($BG$2)-1","v":2015}]
[null,null,{"$f":"Start!AA4&\"      \"&\"Erfassungsdatum: \"&TEXT(Start!E16,\"TT.MM.JJJJ\")&\"     \"&\"für Monat: \"&TEXT(Start!AA46,\"MM/JJJJ\")&\"       \"&\"erfasst von: \"&TEXT(Start!E17,\"\")","v":"Firma:  Mustermann GmbH      Erfassungsdatum: 10.05.2016     für Monat: 04/2016       erfasst von: Max Muster"},null,null,null,null,null,null,null,null,null,null,null,null,null,null,null,null,null,null,null,null,null,null,null,null,null,null,null,null,null,null,null,null,null,null,null,null,null,null,null,null,null,null,null,null,null,null,null,null,null,null,null,null,null,null,1,{"$f":"YEAR($BG$2)-1","v":2015},null,2]
[null,null,null,null,null,null,null,null,null,null,null,null,null,null,null,null,null,null,null,null,null,null,null,null,null,null,null,null,null,null,null,null,null,null,null,null,null,null,null,null,null,null,null,null,null,null,null,null,null,null,null,null,null,null,null,null,null,2,{"$f":"YEAR($BG$2)","v":2016},null,{"$f":"VLOOKUP(BI4,BF3:BG7,2)","v":2016}]
[null,null,null,null,null,null,null,null,null,null,null,null,null,null,null,null,null,null,null,null,null,null,null,null,null,null,null,null,null,null,null,null,null,null,null,null,null,null,null,null,null,null,null,null,null,null,null,null,null,null,null,null,null,null,null,null,null,3,{"$f":"YEAR($BG$2)+1","v":2017}]
[null,null,null,{"$f":"BI5","v":2016},null,null,null,null,null,null,null,null,null,null,null,null,null,null,null,null,null,null,null,null,null,null,null,null,null,null,null,null,null,null,null,null,null,null,null,null,null,null,null,null,null,null,null,null,null,null,null,null,null,null,null,null,null,4,{"$f":"YEAR($BG$2)+2","v":2018}]
[]
[null,null,null,{"$f":"DATE($D$7,1,1)","v":"2016-01-01"},{"$f":"DATE($D$7,2,1)","v":"2016-02-01"},{"$f":"DATE($D$7,3,1)","v":"2016-03-01"},{"$f":"DATE($D$7,4,1)","v":"2016-04-01"},{"$f":"DATE($D$7,5,1)","v":"2016-05-01"},{"$f":"DATE($D$7,6,1)","v":"2016-06-01"},{"$f":"DATE($D$7,7,1)","v":"2016-07-01"},{"$f":"DATE($D$7,8,1)","v":"2016-08-01"},{"$f":"DATE($D$7,9,1)","v":"2016-09-01"},{"$f":"DATE($D$7,10,1)","v":"2016-10-01"},{"$f":"DATE($D$7,11,1)","v":"2016-11-01"},{"$f":"DATE($D$7,12,1)","v":"2016-12-01"}]
[null,null,"Chefinfo Angebotsübersicht",null,null,null,null,null,null,null,null,null,null,null,null,null,null,null,null,null,null,null,null,null,null,null,null,null,null,null,null,null,null,null,null,null,null,null,null,null,null,null,"Jahr",null,null,null,null,null,null,null,"Grenzwerte",null,null,"Handlungsanweisungen"]
[null,null,null,{"$f":"MONTH(D9)","v":1},{"$f":"MONTH(E9)","v":2},3,4,5,6,7,8,9,10,11,12]
[null,null,null,"Jan","Feb","Mrz","Apr","Mai","Jun","Jul","Aug","Sept","Okt","Nov","Dez",null,"jan",null,null,null,null,null,null,null,null,null,null,null,null,null,null,null,null,null,null,null,null,null,null,null,null,null,"kum.",null,null,null,null,null,null,null,">= grün",">= gelb","rot",1,2,3]
[null,null,"Auftragswert in T€",{"$f":"IF(Q14=0,\"\",Q13)","v":""},{"$f":"IF(R14=0,\"\",R13)","v":480},"","","","","","","","","","",null,{"$f":"IF(D14>0,SUMPRODUCT((Angebote!$B$14:$B$24>=DATE($D$7,D$11,1))*(Angebote!$B$14:$B$24<=DATE($D$7,D$11,31))*(OR(Angebote!$P$14:$P$24=1,Angebote!$P$14:$P$24=2))*(Angebote!$B$14:$B$24<>\"#NV\"),Angebote!$Q$14:$Q$24),\"\")","v":0},{"$f":"IF(E14>0,SUMPRODUCT((Angebote!$B$14:$B$24>=DATE($D$7,E$11,1))*(Angebote!$B$14:$B$24<=DATE($D$7,E$11,31))*(OR(Angebote!$P$14:$P$24=1,Angebote!$P$14:$P$24=2))*(Angebote!$B$14:$B$24<>\"#NV\"),Angebote!$Q$14:$Q$24),\"\")","v":480},{"$f":"IF(F14>0,SUMPRODUCT((Angebote!$B$14:$B$24>=DATE($D$7,F$11,1))*(Angebote!$B$14:$B$24<=DATE($D$7,F$11,31))*(OR(Angebote!$P$14:$P$24=1,Angebote!$P$14:$P$24=2))*(Angebote!$B$14:$B$24<>\"#NV\"),Angebote!$Q$14:$Q$24),\"\")","v":0},{"$f":"IF(G14>0,SUMPRODUCT((Angebote!$B$14:$B$24>=DATE($D$7,G$11,1))*(Angebote!$B$14:$B$24<=DATE($D$7,G$11,31))*(OR(Angebote!$P$14:$P$24=1,Angebote!$P$14:$P$24=2))*(Angebote!$B$14:$B$24<>\"#NV\"),Angebote!$Q$14:$Q$24),\"\")","v":0},{"$f":"IF(H14>0,SUMPRODUCT((Angebote!$B$14:$B$24>=DATE($D$7,H$11,1))*(Angebote!$B$14:$B$24<=DATE($D$7,H$11,31))*(OR(Angebote!$P$14:$P$24=1,Angebote!$P$14:$P$24=2))*(Angebote!$B$14:$B$24<>\"#NV\"),Angebote!$Q$14:$Q$24),\"\")","v":0},{"$f":"IF(I14>0,SUMPRODUCT((Angebote!$B$14:$B$24>=DATE($D$7,I$11,1))*(Angebote!$B$14:$B$24<=DATE($D$7,I$11,31))*(OR(Angebote!$P$14:$P$24=1,Angebote!$P$14:$P$24=2))*(Angebote!$B$14:$B$24<>\"#NV\"),Angebote!$Q$14:$Q$24),\"\")","v":0},{"$f":"IF(J14>0,SUMPRODUCT((Angebote!$B$14:$B$24>=DATE($D$7,J$11,1))*(Angebote!$B$14:$B$24<=DATE($D$7,J$11,31))*(OR(Angebote!$P$14:$P$24=1,Angebote!$P$14:$P$24=2))*(Angebote!$B$14:$B$24<>\"#NV\"),Angebote!$Q$14:$Q$24),\"\")","v":0},{"$f":"IF(K14>0,SUMPRODUCT((Angebote!$B$14:$B$24>=DATE($D$7,K$11,1))*(Angebote!$B$14:$B$24<=DATE($D$7,K$11,31))*(OR(Angebote!$P$14:$P$24=1,Angebote!$P$14:$P$24=2))*(Angebote!$B$14:$B$24<>\"#NV\"),Angebote!$Q$14:$Q$24),\"\")","v":0},{"$f":"IF(L14>0,SUMPRODUCT((Angebote!$B$14:$B$24>=DATE($D$7,L$11,1))*(Angebote!$B$14:$B$24<=DATE($D$7,L$11,31))*(OR(Angebote!$P$14:$P$24=1,Angebote!$P$14:$P$24=2))*(Angebote!$B$14:$B$24<>\"#NV\"),Angebote!$Q$14:$Q$24),\"\")","v":0},{"$f":"IF(M14>0,SUMPRODUCT((Angebote!$B$14:$B$24>=DATE($D$7,M$11,1))*(Angebote!$B$14:$B$24<=DATE($D$7,M$11,31))*(OR(Angebote!$P$14:$P$24=1,Angebote!$P$14:$P$24=2))*(Angebote!$B$14:$B$24<>\"#NV\"),Angebote!$Q$14:$Q$24),\"\")","v":0},{"$f":"IF(N14>0,SUMPRODUCT((Angebote!$B$14:$B$24>=DATE($D$7,N$11,1))*(Angebote!$B$14:$B$24<=DATE($D$7,N$11,31))*(OR(Angebote!$P$14:$P$24=1,Angebote!$P$14:$P$24=2))*(Angebote!$B$14:$B$24<>\"#NV\"),Angebote!$Q$14:$Q$24),\"\")","v":0},{"$f":"IF(O14>0,SUMPRODUCT((Angebote!$B$14:$B$24>=DATE($D$7,O$11,1))*(Angebote!$B$14:$B$24<=DATE($D$7,O$11,31))*(OR(Angebote!$P$14:$P$24=1,Angebote!$P$14:$P$24=2))*(Angebote!$B$14:$B$24<>\"#NV\"),Angebote!$Q$14:$Q$24),\"\")","v":0},null,null,null,null,null,null,null,null,null,null,null,null,null,null,{"$f":"Q13+R13+S13+T13+U13+V13+W13+X13+Y13+Z13+AA13+AB13","v":480},null,null,{"$f":"IF(AQ13>=AY13,1,IF(AQ13>=AZ13,2,3))","v":3},{"$f":"AQ13","v":480},null,{"$f":"HLOOKUP(AT13,$BB$12:$BD$22,2)","v":"Handlungsanweisung für rot"},null,2000,500,null,"Handlungsanweisung für grün","Handlungsanweisung für gelb","Handlungsanweisung für rot"]
[null,null,"Anzahl erhaltene Aufträge",{"$f":"IF(Q14=0,\"\",Q14)","v":""},{"$f":"IF(R14=0,\"\",R14)","v":2},"","","","","","","","","","",null,{"$f":"(SUMPRODUCT((Angebote!$B$14:$B$23>=DATE($D$7,D$11,1))*(Angebote!$B$14:$B$23<=DATE($D$7,D$11,31))*(Angebote!$P$14:$P$23=1)*(Angebote!$B$14:$B$23<>\"#NV\")))+(SUMPRODUCT((Angebote!$B$14:$B$23>=DATE($D$7,D$11,1))*(Angebote!$B$14:$B$23<=DATE($D$7,D$11,31))*(Angebote!$P$14:$P$23=2)*(Angebote!$B$14:$B$23<>\"#NV\")))","v":0},{"$f":"(SUMPRODUCT((Angebote!$B$14:$B$23>=DATE($D$7,E$11,1))*(Angebote!$B$14:$B$23<=DATE($D$7,E$11,31))*(Angebote!$P$14:$P$23=1)*(Angebote!$B$14:$B$23<>\"#NV\")))+(SUMPRODUCT((Angebote!$B$14:$B$23>=DATE($D$7,E$11,1))*(Angebote!$B$14:$B$23<=DATE($D$7,E$11,31))*(Angebote!$P$14:$P$23=2)*(Angebote!$B$14:$B$23<>\"#NV\")))","v":2},{"$f":"(SUMPRODUCT((Angebote!$B$14:$B$23>=DATE($D$7,F$11,1))*(Angebote!$B$14:$B$23<=DATE($D$7,F$11,31))*(Angebote!$P$14:$P$23=1)*(Angebote!$B$14:$B$23<>\"#NV\")))+(SUMPRODUCT((Angebote!$B$14:$B$23>=DATE($D$7,F$11,1))*(Angebote!$B$14:$B$23<=DATE($D$7,F$11,31))*(Angebote!$P$14:$P$23=2)*(Angebote!$B$14:$B$23<>\"#NV\")))","v":0},{"$f":"(SUMPRODUCT((Angebote!$B$14:$B$23>=DATE($D$7,G$11,1))*(Angebote!$B$14:$B$23<=DATE($D$7,G$11,31))*(Angebote!$P$14:$P$23=1)*(Angebote!$B$14:$B$23<>\"#NV\")))+(SUMPRODUCT((Angebote!$B$14:$B$23>=DATE($D$7,G$11,1))*(Angebote!$B$14:$B$23<=DATE($D$7,G$11,31))*(Angebote!$P$14:$P$23=2)*(Angebote!$B$14:$B$23<>\"#NV\")))","v":0},{"$f":"(SUMPRODUCT((Angebote!$B$14:$B$23>=DATE($D$7,H$11,1))*(Angebote!$B$14:$B$23<=DATE($D$7,H$11,31))*(Angebote!$P$14:$P$23=1)*(Angebote!$B$14:$B$23<>\"#NV\")))+(SUMPRODUCT((Angebote!$B$14:$B$23>=DATE($D$7,H$11,1))*(Angebote!$B$14:$B$23<=DATE($D$7,H$11,31))*(Angebote!$P$14:$P$23=2)*(Angebote!$B$14:$B$23<>\"#NV\")))","v":0},{"$f":"(SUMPRODUCT((Angebote!$B$14:$B$23>=DATE($D$7,I$11,1))*(Angebote!$B$14:$B$23<=DATE($D$7,I$11,31))*(Angebote!$P$14:$P$23=1)*(Angebote!$B$14:$B$23<>\"#NV\")))+(SUMPRODUCT((Angebote!$B$14:$B$23>=DATE($D$7,I$11,1))*(Angebote!$B$14:$B$23<=DATE($D$7,I$11,31))*(Angebote!$P$14:$P$23=2)*(Angebote!$B$14:$B$23<>\"#NV\")))","v":0},{"$f":"(SUMPRODUCT((Angebote!$B$14:$B$23>=DATE($D$7,J$11,1))*(Angebote!$B$14:$B$23<=DATE($D$7,J$11,31))*(Angebote!$P$14:$P$23=1)*(Angebote!$B$14:$B$23<>\"#NV\")))+(SUMPRODUCT((Angebote!$B$14:$B$23>=DATE($D$7,J$11,1))*(Angebote!$B$14:$B$23<=DATE($D$7,J$11,31))*(Angebote!$P$14:$P$23=2)*(Angebote!$B$14:$B$23<>\"#NV\")))","v":0},{"$f":"(SUMPRODUCT((Angebote!$B$14:$B$23>=DATE($D$7,K$11,1))*(Angebote!$B$14:$B$23<=DATE($D$7,K$11,31))*(Angebote!$P$14:$P$23=1)*(Angebote!$B$14:$B$23<>\"#NV\")))+(SUMPRODUCT((Angebote!$B$14:$B$23>=DATE($D$7,K$11,1))*(Angebote!$B$14:$B$23<=DATE($D$7,K$11,31))*(Angebote!$P$14:$P$23=2)*(Angebote!$B$14:$B$23<>\"#NV\")))","v":0},{"$f":"(SUMPRODUCT((Angebote!$B$14:$B$23>=DATE($D$7,L$11,1))*(Angebote!$B$14:$B$23<=DATE($D$7,L$11,31))*(Angebote!$P$14:$P$23=1)*(Angebote!$B$14:$B$23<>\"#NV\")))+(SUMPRODUCT((Angebote!$B$14:$B$23>=DATE($D$7,L$11,1))*(Angebote!$B$14:$B$23<=DATE($D$7,L$11,31))*(Angebote!$P$14:$P$23=2)*(Angebote!$B$14:$B$23<>\"#NV\")))","v":0},{"$f":"(SUMPRODUCT((Angebote!$B$14:$B$23>=DATE($D$7,M$11,1))*(Angebote!$B$14:$B$23<=DATE($D$7,M$11,31))*(Angebote!$P$14:$P$23=1)*(Angebote!$B$14:$B$23<>\"#NV\")))+(SUMPRODUCT((Angebote!$B$14:$B$23>=DATE($D$7,M$11,1))*(Angebote!$B$14:$B$23<=DATE($D$7,M$11,31))*(Angebote!$P$14:$P$23=2)*(Angebote!$B$14:$B$23<>\"#NV\")))","v":0},{"$f":"(SUMPRODUCT((Angebote!$B$14:$B$23>=DATE($D$7,N$11,1))*(Angebote!$B$14:$B$23<=DATE($D$7,N$11,31))*(Angebote!$P$14:$P$23=1)*(Angebote!$B$14:$B$23<>\"#NV\")))+(SUMPRODUCT((Angebote!$B$14:$B$23>=DATE($D$7,N$11,1))*(Angebote!$B$14:$B$23<=DATE($D$7,N$11,31))*(Angebote!$P$14:$P$23=2)*(Angebote!$B$14:$B$23<>\"#NV\")))","v":0},{"$f":"(SUMPRODUCT((Angebote!$B$14:$B$23>=DATE($D$7,O$11,1))*(Angebote!$B$14:$B$23<=DATE($D$7,O$11,31))*(Angebote!$P$14:$P$23=1)*(Angebote!$B$14:$B$23<>\"#NV\")))+(SUMPRODUCT((Angebote!$B$14:$B$23>=DATE($D$7,O$11,1))*(Angebote!$B$14:$B$23<=DATE($D$7,O$11,31))*(Angebote!$P$14:$P$23=2)*(Angebote!$B$14:$B$23<>\"#NV\")))","v":0},null,null,null,null,null,null,null,null,null,null,null,null,null,null,{"$f":"Q14+R14+S14+T14+U14+V14+W14+X14+Y14+Z14+AA14+AB14","v":2},null,null,{"$f":"IF(AQ14>=AY14,1,IF(AQ14>=AZ14,2,3))","v":3},{"$f":"AQ14","v":2},null,{"$f":"HLOOKUP(AT14,$BB$12:$BD$22,3)","v":"Handlungsanweisung für rot"},null,10,6,null,"Handlungsanweisung für grün","Handlungsanweisung für gelb","Handlungsanweisung für rot"]
[]
{"$rows_left_out":23}
{"sheet":"Angebote","index":3,"n_rows":42,"n_cols":26,"rows_kept":42,"cut":false,"hidden":false,"merged":[[10,15,10,17],[10,0,10,12],[11,10,12,10],[11,9,12,9],[11,0,12,0],[11,16,12,16]]}
[]
["Auftragsplanung | Angebotsübersicht",null,null,null,null,null,null,{"$f":"TODAY()","v":"2016-08-09"}]
[]
[{"$f":"Start!AA4&\"      \"&\"Erfassungsdatum: \"&TEXT(Start!E16,\"TT.MM.JJJJ\")&\"     \"&\"für Monat: \"&TEXT(Start!AA46,\"MM/JJJJ\")&\"       \"&\"erfasst von: \"&TEXT(Start!E17,\"\")","v":"Firma:  Mustermann GmbH      Erfassungsdatum: 10.05.2016     für Monat: 04/2016       erfasst von: Max Muster"}]
[null,null,null,null,null,null,null,null,null,"privat"]
[null,null,null,null,null,null,null,null,null,"gewerblich"]
[null,null,null,null,null,null,null,null,null,"Architekt"]
[null,null,null,null,null,null,null,null,null,"Bauträger"]
[null,null,null,null,null,null,null,null,null,"öffentl. Hand"]
[null,null,null,null,null,null,null,null,null,"sonstige"]
["Angebotsübersicht",null,null,null,null,null,null,null,null,null,null,null,null,null,"Angebotsstatus","Angebotsstatus"]
["lfd. Nr.",null,null,null,null,null,null,null,null,"Angebots-wert in \nT€","Angebote offen in \nT€",null,null,null,null,null,"Auftrags\n-wert in T€"]
[null,"Angebots-  datum","Angebots\nNr.","Auftraggeber","Herkunft","Bau-\nvorhaben","Produkt-\nbereich","Ort","Telefon",null,null,"Ausführungs-zeitraum","Entscheidungs-zeitraum",null,"    Entschei-\ndungsstatus","Status",null,"Kommentar"]
[1,"2016-02-01",15477,"Fa. Maier","gewerblich","Einkaufsmarkt","Gewerbebau","München",null,300,{"$f":"IF(P14=\"offen\",J14,\"\")","v":""},"2016-04-01","2016-03-01","=",null,1,{"$f":"IF(OR(P14=1,P14=2),J14,\"\")","v":300},null,{"$f":"IF(P14=\"offen\",1,0)","v":0},{"$f":"Einrichtung!B13","v":"Neubau-Privatkd."},{"$f":"IF(P14=1,J14,0)","v":300},null,"offen"]
[2,"2016-02-15",15478,"Fa. Huber","Architekt","Hallen","Gewerbebau","Rosenheim",null,240,{"$f":"IF(P15=\"offen\",J15,\"\")","v":""},"Mai","2016-04-01",null,null,0,{"$f":"IF(OR(P15=1,P15=2),J15,\"\")","v":""},"zu teuer-5%, Fa. Mittermeier hats bekommen!",{"$f":"IF(P15=\"offen\",1,0)","v":0},{"$f":"Einrichtung!B14","v":"Gewerbebau"},null,null,0]
{"$rows_left_out":28}
{"sheet":"Aufträge","index":4,"n_rows":42,"n_cols":44,"rows_kept":42,"cut":false,"hidden":false,"merged":[[33,26,33,27],[6,39,6,40],[8,39,8,40],[10,29,10,31],[10,20,10,22],[10,37,10,40],[10,23,10,24],[10,25,10,26],[9,17,9,26],[10,17,10,19],[9,37,9,40],[11,17,11,19],[11,20,11,22],[11,23,11,24],[11,25,11,26],[9,11,9,13],[9,0,9,10],[10,11,10,13],[27,26,27,27],[31,26,31,27],[29,26,29,27],[12,18,12,19]]}
[]
["Auftragsplanung | Auftragsübersicht"]
[]
[{"$f":"Start!AA4&\"      \"&\"Erfassungsdatum: \"&TEXT(Start!E16,\"TT.MM.JJJJ\")&\"     \"&\"für Monat: \"&TEXT(Start!AA46,\"MM/JJJJ\")&\"       \"&\"erfasst von: \"&TEXT(Start!E17,\"\")","v":"Firma:  Mustermann GmbH      Erfassungsdatum: 10.05.2016     für Monat: 04/2016       erfasst von: Max Muster"}]
[null,null,null,null,null,null,null,null,null,null,null,null,null,null,null,null,null,null,null,"ja"]
[]
[]
[null,null,null,null,null,null,null,null,null,null,null,null,null,null,null,null,null,null,null,null,null,null,null,null,null,null,null,null,null,null,null,null,null,null,null,null,null,null,null,null,{"$f":"Start!R28","v":42461}]
[null,null,null,null,null,null,null,null,null,null,null,null,null,null,null,null,"Auftragswerte - Produktionsstand"]
["Auftragsübersicht",null,null,null,null,null,null,null,null,null,null,"Abschlussrechnung",null,null,null,null,null,"Bewertung der Leistung",null,null,null,null,null,null,null,null,null,null,null,null,null,null,null,null,null,null,null,"Bewertung teilfertige"]
[null,null,null,null,null,null,null,null,null,null,"korr.",null,null,null,null,null,null,null,null,null,null,null,null,null,null,null,null,null,null,"Istwerte",null,null,null,null,null,null,null,"Arbeiten in T€"]
[null,null,null,null,null,null,null,null,"Auftrags-","Regie/","Auftrags-",null,null,null,"Aufträge ",null,null,"Materialverbrauch",null,null,"Lohnkosten",null,null,"Fertigungsstand",null,"Fremdleistungen"]
["lfd.","Angebots-","Auftrags-","Auftrag-","Bau-","Produkt-",null,"Fertig-","wert in ","Nachträge ","wert in ","Re.","Betrag","bezahlt","nicht",null,"Plan","Plan","IST",null,"Plan","Plan","Plan","IST","IST","Plan","IST","gestellte","Stand","Material ","Fertigstellungsstand","Fremdleist.",null,null,null,null,null,null,"Auftragswert"]
["Nr.","datum","nummer","geber","vorhaben","bereich","Beginn","stellung","T€","in T€","T€","Datum","in T€ ",null,"abgr.",null," in %"," in T€ "," in %","In T€","Std.Satz","in T€","in std.","in %","in Std."," in T€","in T€","TR in T€","Std.","in T€"," in T€ "," in T€",null,null,null,null,null,"TF- Arb.","abrechenbar","TR","Differenz"]
[{"$f":"Angebote!A14","v":1},{"$f":"IF(OR(Angebote!$P14=1,Angebote!$P14=2),Angebote!B14,\"\")","v":"2016-02-01"},{"$f":"IF(OR(Angebote!$P14=1,Angebote!$P14=2),Angebote!C14,\"\")","v":15477},{"$f":"IF(OR(Angebote!$P14=1,Angebote!$P14=2),Angebote!D14,\"\")","v":"Fa. Maier"},{"$f":"IF(OR(Angebote!$P14=1,Angebote!$P14=2),Angebote!F14,\"\")","v":"Einkaufsmarkt"},{"$f":"IF(OR(Angebote!$P14=1,Angebote!$P14=2),Angebote!G14,\"\")","v":"Gewerbebau"},"2016-04-01","2016-05-30",{"$f":"IF(OR(Angebote!$P14=1,Angebote!$P14=2),Angebote!Q14,\"\")","v":300},5,{"$f":"IF(J15<>0,I15+J15,I15)","v":305},null,null,null,{"$f":"IF(M15=\"\",K15,\"\")","v":305},null,{"$f":"IF(F15=\"\",\"\",VLOOKUP(F15,Einrichtung!$B$13:$E$17,2,0))","v":0.35},{"$f":"IF(K15=\"\",\"\",Q15*K15)","v":106.75},1,null,{"$f":"IF(F15=\"\",\"\",VLOOKUP(F15,Einrichtung!$B$13:$E$17,4,0))","v":39},{"$f":"IF(W15=\"\",\"\",(U15*W15)/1000)","v":167.75000000000003},{"$f":"IF(K15=\"\",\"\",(K15-R15-Z15)/(U15/1000))","v":4301.2820512820517},null,1000,{"$f":"IF(F15=\"\",\"\",VLOOKUP(F15,Einrichtung!$B$13:$E$17,3,0)*K15)","v":30.5},30.5,100,{"$f":"IF(AND(U15=\"\",Y15=\"\"),\"\",IF(Y15>W15,U15*W15/1000,Y15*U15/1000))","v":39},{"$f":"IF(R15=\"\",\"\",IF(S15>0,R15*S15,T15))","v":106.75},{"$f":"IF(AND(X15=\"\",Y15=\"\",),\"\",IF(Y15>0,U15*Y15/1000,(U15*W15)/1000*X15))","v":39},{"$f":"IF(Z15=0,\"0\",AA15)","v":30.5},{"$f":"AB15/O15","v":0.32786885245901637},null,{"$f":"IF(M15>0,1,AJ15)","v":0.57786885245901642},{"$f":"IFERROR(AL15/K15,0)","v":0.57786885245901642},null,{"$f":"IF(AND(L15=\"\",AD15<>\"\"),AD15+AE15+AF15,\"\")","v":176.25},{"$f":"IF(OR(AL15<=K15,AL15=\"\"),AL15,K15)","v":176.25},{"$f":"IF(L15<>0,0,AB15)","v":100},{"$f":"IF(AM15=\"\",\"\",AM15-AN15)","v":76.25},{"$f":"Y15*100/W15","v":23.248882265275707},{"$f":"AB15/AL15","v":0.56737588652482274},{"$f":"IFERROR(IF(AND(W15>0,X15=\"\",Y15=\"\"),W15,IF(X15>0,W15*(100%-X15),IF(Y15>0,W15-Y15,0))),0)","v":3301.2820512820517}]
{"$rows_left_out":28}
{"sheet":"Einrichtung","index":5,"n_rows":35,"n_cols":23,"rows_kept":35,"cut":false,"hidden":false,"merged":[[10,1,10,4]]}
[]
[null,"Auftragsplanung | Einrichtung",null,null,null,null,null,null,null,null,null,null,null,null,null,null,null,null,null,null,null,2,2]
[]
[null,{"$f":"Start!AA4&\"      \"&\" \"&Intern!A4","v":"Firma:  Mustermann GmbH       Version 1.20"}]
[]
[]
[]
[]
[]
[]
[null,"Eingabe der Planvorgaben"]
[null,"Produktbereich","Materialeinsatz in %","Fremdleistung\nin %","Stundensatz\nVorgabezeit"]
[null,"Neubau-Privatkd.",0.38,0.3,42.5]
[null,"Gewerbebau",0.35,0.1,39]
[null,"Renovierung",0.3,0.1,45]
{"$rows_left_out":21}
{"sheet":"Anleitung","index":6,"n_rows":4,"n_cols":22,"rows_kept":4,"cut":false,"hidden":false,"merged":[[10,1,10,3]]}
[]
[null,"Auftragsplanung | Anleitung",null,null,null,null,null,null,null,null,null,null,null,null,null,null,null,null,null,null,null,1]
[]
[null,{"$f":"\"  \"&Start!AA4&\"      \"&\" \"&Intern!A4","v":"  Firma:  Mustermann GmbH       Version 1.20"}]

{"sheet":"Intern","index":7,"n_rows":37,"n_cols":2,"rows_kept":37,"cut":false,"hidden":true,"merged":[[3,2,3,4]]}
[]
["UnternehmerKompass© 2012 Auftragsplanung - Intern"]
[]
["Version 1.20","© bauerundpartner"]
[]
[]
[]
[]
[]
[]
[]
["Changelog:"]
[]
["16.09.2010: - Veränderung der Formel im Auftragsblatt (Berechnung der gel. IST Arbeitszeit korrigiert. Nicht über 100%)"]
["15.10.2010: - Veränderung / Hinzufügen des Indexeintrags \"Erfasst durch\" & Verlinkung"]
{"$rows_left_out":22}